Target
Sodium/glucose cotransporter 2
Ligand
BDBM50265182
Substrate
Meas. Tech.
ChEMBL_496716 (CHEMBL1005353)
IC50
15050±n/a nM
Citation
 Lansdell, MIBurring, DJHepworth, DStrawbridge, MGraham, EGuyot, TBetson, MSHart, JD Design and synthesis of fluorescent SGLT2 inhibitors. Bioorg Med Chem Lett 18:4944-7 (2008)  
Target
Name:
Sodium/glucose cotransporter 2
Synonyms:
Na(+)/glucose cotransporter 2 SGLT2 Sodium-Dependent Glucose Cotransporter 2 (SGLT2) Solute carrier family 5 member 2
Type:
Protein
Mol. Mass.:
72902.00
Organism:
Homo sapiens (Human)
Description:
P31639
Residue:
672
  
Inhibitor
Name:
BDBM50265182
Synonyms:
5-(6-((4-(2-chloro-5-((2S,3R,4R,5S,6R)-3,4,5-trihydroxy-6-(hydroxymethyl)tetrahydro-2H-pyran-2-yl)benzyl)benzyl)(methyl)amino)-6-oxohexylcarbamoyl)-2-(6-hydroxy-3-oxo-3H-xanthen-9-yl)benzoic acid | CHEMBL466749
Type:
Small organic molecule
Emp. Form.:
C48H47ClN2O12
Mol. Mass.:
879.346
SMILES:
CN(Cc1ccc(Cc2cc(ccc2Cl)[C@@H]2O[C@H](CO)[C@@H](O)[C@H](O)[C@H]2O)cc1)C(=O)CCCCCNC(=O)c1ccc(c(c1)C(O)=O)-c1c2ccc(O)cc2oc2cc(=O)ccc12
: