Target
Transcriptional activator protein LuxR
Ligand
BDBM50266234
Substrate
Meas. Tech.
ChEMBL_543887 (CHEMBL1019483)
EC50
350±n/a nM
Citation
 Geske, GDMattmann, MEBlackwell, HE Evaluation of a focused library of N-aryl L-homoserine lactones reveals a new set of potent quorum sensing modulators. Bioorg Med Chem Lett 18:5978-81 (2008)  
Target
Name:
Transcriptional activator protein LuxR
Synonyms:
LUXS_ALIF1 | luxR
Type:
PROTEIN
Mol. Mass.:
28527.37
Organism:
Vibrio fischeri (strain ATCC 700601 / ES114)
Description:
ChEMBL_543884
Residue:
250
  
Inhibitor
Name:
BDBM50266234
Synonyms:
(S)-N-(2-oxotetrahydrofuran-3-yl)-2-(4-(trifluoromethylthio)phenyl)acetamide | CHEMBL458227
Type:
Small organic molecule
Emp. Form.:
C13H12F3NO3S
Mol. Mass.:
319.299
SMILES:
FC(F)(F)Sc1ccc(CC(=O)N[C@H]2CCOC2=O)cc1
: