Target
Peroxisome proliferator-activated receptor alpha
Ligand
BDBM50264018
Substrate
Meas. Tech.
ChEMBL_535520 (CHEMBL986146)
EC50
331±n/a nM
Citation
 Kim, EPark, CSHan, TBae, MHChong, WLee, CHShin, YAAhn, BNKim, MKShin, CYSon, MHKim, JKMoon, HSShim, HJKim, EJKim, SHLim, JILee, CH Design, synthesis, and evaluation of novel aryl-tetrahydropyridine PPARalpha/gamma dual agonists. Bioorg Med Chem Lett 18:4993-6 (2008)  
Target
Name:
Peroxisome proliferator-activated receptor alpha
Synonyms:
NR1C1 PPAR PPAR-alpha PPARA_HUMAN Peroxisome proliferator-activated receptor | Peroxisome proliferator-activated receptor alpha (PPAR alpha)
Type:
Enzyme
Mol. Mass.:
52222.08
Organism:
Homo sapiens (Human)
Description:
Q07869
Residue:
468
  
Inhibitor
Name:
BDBM50264018
Synonyms:
2-(3-(2-(4-(4-chlorophenyl)-5,6-dihydropyridin-1(2H)-yl)ethoxy)phenoxy)-2-methylpropanoic acid | CHEMBL489769
Type:
Small organic molecule
Emp. Form.:
C23H26ClNO4
Mol. Mass.:
415.91
SMILES:
CC(C)(Oc1cccc(OCCN2CCC(=CC2)c2ccc(Cl)cc2)c1)C(O)=O
: