Target
Peroxisome proliferator-activated receptor gamma
Ligand
BDBM28798
Substrate
Meas. Tech.
ChEMBL_535521 (CHEMBL986147)
EC50
704±n/a nM
Citation
 Kim, EPark, CSHan, TBae, MHChong, WLee, CHShin, YAAhn, BNKim, MKShin, CYSon, MHKim, JKMoon, HSShim, HJKim, EJKim, SHLim, JILee, CH Design, synthesis, and evaluation of novel aryl-tetrahydropyridine PPARalpha/gamma dual agonists. Bioorg Med Chem Lett 18:4993-6 (2008)  
Target
Name:
Peroxisome proliferator-activated receptor gamma
Synonyms:
NR1C3 PPAR-gamma PPARG_HUMAN Peroxisome proliferator-activated receptor gamma (PPAR gamma) Peroxisome proliferator-activated receptor gamma (PPARĪ³) peroxisome proliferator-activated receptor gamma isoform 2
Type:
Nuclear Receptor
Mol. Mass.:
57613.46
Organism:
Homo sapiens (Human)
Description:
P37231
Residue:
505
  
Inhibitor
Name:
BDBM28798
Synonyms:
(2S)-2-ethoxy-3-(4-{2-[4-(methanesulfonyloxy)phenyl]ethoxy}phenyl)propanoic acid Galida | tesaglitazar
Type:
Small organic molecule
Emp. Form.:
C20H24O7S
Mol. Mass.:
408.465
SMILES:
CCO[C@@H](Cc1ccc(OCCc2ccc(OS(C)(=O)=O)cc2)cc1)C(O)=O
: