Target
Peroxisome proliferator-activated receptor gamma
Ligand
BDBM50263848
Substrate
Meas. Tech.
ChEMBL_535521 (CHEMBL986147)
EC50
670±n/a nM
Citation
 Kim, EPark, CSHan, TBae, MHChong, WLee, CHShin, YAAhn, BNKim, MKShin, CYSon, MHKim, JKMoon, HSShim, HJKim, EJKim, SHLim, JILee, CH Design, synthesis, and evaluation of novel aryl-tetrahydropyridine PPARalpha/gamma dual agonists. Bioorg Med Chem Lett 18:4993-6 (2008)  
Target
Name:
Peroxisome proliferator-activated receptor gamma
Synonyms:
NR1C3 PPAR-gamma PPARG_HUMAN Peroxisome proliferator-activated receptor gamma (PPAR gamma) Peroxisome proliferator-activated receptor gamma (PPARĪ³) peroxisome proliferator-activated receptor gamma isoform 2
Type:
Nuclear Receptor
Mol. Mass.:
57613.46
Organism:
Homo sapiens (Human)
Description:
P37231
Residue:
505
  
Inhibitor
Name:
BDBM50263848
Synonyms:
3-(4-(2-(4-(3,4-dichlorophenyl)-5,6-dihydropyridin-1(2H)-yl)ethoxy)phenyl)-2-ethoxypropanoic acid | CHEMBL490402
Type:
Small organic molecule
Emp. Form.:
C24H27Cl2NO4
Mol. Mass.:
464.381
SMILES:
CCOC(Cc1ccc(OCCN2CCC(=CC2)c2ccc(Cl)c(Cl)c2)cc1)C(O)=O
: