Target
Matrix metalloproteinase-9
Ligand
BDBM50246792
Substrate
Meas. Tech.
ChEMBL_557954 (CHEMBL963052)
IC50
3.0±n/a nM
Citation
 Ledour, GMoroy, GRouffet, MBourguet, EGuillaume, DDecarme, MElmourabit, HAugé, FAlix, AJLaronze, JYBellon, GHornebeck, WSapi, J Introduction of the 4-(4-bromophenyl)benzenesulfonyl group to hydrazide analogs of Ilomastat leads to potent gelatinase B (MMP-9) inhibitors with improved selectivity. Bioorg Med Chem 16:8745-59 (2008)  
Target
Name:
Matrix metalloproteinase-9
Synonyms:
67 kDa matrix metalloproteinase-9 92 kDa gelatinase CLG4B Gelatinase B MMP9 Matrix metalloproteinase 9 (MMP-9) Matrix metalloproteinase-9 (MMP9)
Type:
Enzyme
Mol. Mass.:
78452.28
Organism:
Homo sapiens (Human)
Description:
P14780
Residue:
707
  
Inhibitor
Name:
BDBM50246792
Synonyms:
CHEMBL508335 | N'-{3-(R)-[2-(S)-(1H-Indol-3-yl)-1-(methylcarbamoyl)-ethylcarbamoyl]-(5-methylhexanoyl)}-N-4-(4-bromophenyl)-benzenesulfonylhydrazide
Type:
Small organic molecule
Emp. Form.:
C32H36BrN5O5S
Mol. Mass.:
682.628
SMILES:
CNC(=O)[C@H](Cc1c[nH]c2ccccc12)NC(=O)[C@H](CC(C)C)CC(=O)NNS(=O)(=O)c1ccc(cc1)-c1ccc(Br)cc1
: