Target
Dipeptidyl peptidase 9
Ligand
BDBM50253640
Substrate
Meas. Tech.
ChEMBL_538995 (CHEMBL1035669)
Ki
260±n/a nM
Citation
 Connolly, BASanford, DGChiluwal, AKHealey, SEPeters, DEDimare, MTWu, WLiu, YMaw, HZhou, YLi, YJin, ZSudmeier, JLLai, JHBachovchin, WW Dipeptide boronic acid inhibitors of dipeptidyl peptidase IV: determinants of potency and in vivo efficacy and safety. J Med Chem 51:6005-13 (2008)  
Target
Name:
Dipeptidyl peptidase 9
Synonyms:
DPP9 DPRP-2 Dipeptidyl peptidase 9 (DDP9) Dipeptidyl peptidase 9 (DPP9) Dipeptidyl peptidase IX Dipeptidyl peptidase-like protein 9
Type:
Enzyme
Mol. Mass.:
98260.70
Organism:
Homo sapiens (Human)
Description:
Q86TI2
Residue:
863
  
Inhibitor
Name:
BDBM50253640
Synonyms:
(R)-1-((S)-2,5-diamino-5-oxopentanamido)ethylboronic acid | CHEMBL501506
Type:
Small organic molecule
Emp. Form.:
C7H16BN3O4
Mol. Mass.:
217.031
SMILES:
C[C@H](NC(=O)[C@@H](N)CCC(N)=O)B(O)O
: