Target
Cholinesterase
Ligand
BDBM50265252
Substrate
Meas. Tech.
ChEMBL_497075 (CHEMBL997711)
Ki
1.87±n/a nM
Citation
 Butini, SGuarino, ECampiani, GBrindisi, MCoccone, SSFiorini, INovellino, EBelinskaya, TSaxena, AGemma, S Tacrine based human cholinesterase inhibitors: synthesis of peptidic-tethered derivatives and their effect on potency and selectivity. Bioorg Med Chem Lett 18:5213-6 (2008)  
Target
Name:
Cholinesterase
Synonyms:
Acylcholine acylhydrolase Butyrylcholine esterase (BChE) Butyrylcholinesterase (BuChE) CHLE_HUMAN Cholinesterases Pseudocholinesterase
Type:
Homotetramer
Mol. Mass.:
68422.27
Organism:
Homo sapiens (Human)
Description:
P06276
Residue:
602
  
Inhibitor
Name:
BDBM50265252
Synonyms:
(S)-tert-butyl 3-(1H-indol-3-yl)-1-oxo-1-(2-(1,2,3,4-tetrahydroacridin-9-ylamino)ethylamino)propan-2-ylcarbamate | CHEMBL502244
Type:
Small organic molecule
Emp. Form.:
C31H37N5O3
Mol. Mass.:
527.6572
SMILES:
CC(C)(C)OC(=O)N[C@@H](Cc1c[nH]c2ccccc12)C(=O)NCCNc1c2CCCCc2nc2ccccc12
: