Target
Cholinesterase
Ligand
BDBM50265255
Substrate
Meas. Tech.
ChEMBL_497075 (CHEMBL997711)
Ki
25.15±n/a nM
Citation
 Butini, SGuarino, ECampiani, GBrindisi, MCoccone, SSFiorini, INovellino, EBelinskaya, TSaxena, AGemma, S Tacrine based human cholinesterase inhibitors: synthesis of peptidic-tethered derivatives and their effect on potency and selectivity. Bioorg Med Chem Lett 18:5213-6 (2008)  
Target
Name:
Cholinesterase
Synonyms:
Acylcholine acylhydrolase Butyrylcholine esterase (BChE) Butyrylcholinesterase (BuChE) CHLE_HUMAN Cholinesterases Pseudocholinesterase
Type:
Homotetramer
Mol. Mass.:
68422.27
Organism:
Homo sapiens (Human)
Description:
P06276
Residue:
602
  
Inhibitor
Name:
BDBM50265255
Synonyms:
(S)-2-amino-N1,N5-bis(2-(1,2,3,4-tetrahydroacridin-9-ylamino)ethyl)pentanediamide | CHEMBL397271
Type:
Small organic molecule
Emp. Form.:
C35H43N7O2
Mol. Mass.:
593.7616
SMILES:
N[C@@H](CCC(=O)NCCNc1c2CCCCc2nc2ccccc12)C(=O)NCCNc1c2CCCCc2nc2ccccc12
: