Target
Matrix metalloproteinase-9
Ligand
BDBM50265114
Substrate
Meas. Tech.
ChEMBL_497408 (CHEMBL1002949)
Ki
>3000±n/a nM
Citation
 Georgiadis, DYiotakis, A Specific targeting of metzincin family members with small-molecule inhibitors: progress toward a multifarious challenge. Bioorg Med Chem 16:8781-94 (2008)  
Target
Name:
Matrix metalloproteinase-9
Synonyms:
67 kDa matrix metalloproteinase-9 92 kDa gelatinase CLG4B Gelatinase B MMP9 Matrix metalloproteinase 9 (MMP-9) Matrix metalloproteinase-9 (MMP9)
Type:
Enzyme
Mol. Mass.:
78452.28
Organism:
Homo sapiens (Human)
Description:
P14780
Residue:
707
  
Inhibitor
Name:
BDBM50265114
Synonyms:
CHEMBL495502 | N-((2R,6S)-4-(2-(hydroxyamino)-2-oxoethyl)-2,6-dimethylpiperidin-4-yl)-4-((2-methylquinolin-4-yl)methoxy)benzamide
Type:
Small organic molecule
Emp. Form.:
C27H32N4O4
Mol. Mass.:
476.5674
SMILES:
C[C@H]1C[C@](CC(=O)NO)(C[C@@H](C)N1)NC(=O)c1ccc(OCc2cc(C)nc3ccccc23)cc1
: