Target
Stromelysin-2
Ligand
BDBM50104975
Substrate
Meas. Tech.
ChEMBL_497443 (CHEMBL1005437)
Ki
>2000±n/a nM
Citation
 Georgiadis, DYiotakis, A Specific targeting of metzincin family members with small-molecule inhibitors: progress toward a multifarious challenge. Bioorg Med Chem 16:8781-94 (2008)  
Target
Name:
Stromelysin-2
Synonyms:
MMP10 Matrix Metalloproteinase-10 (MMP-10) STMY2
Type:
Enzyme
Mol. Mass.:
54143.02
Organism:
Homo sapiens (Human)
Description:
P09238
Residue:
476
  
Inhibitor
Name:
BDBM50104975
Synonyms:
(8S,11R,12S)-2,10-Dioxo-11-(2'-trifluoromethyl-biphenyl-4-ylmethyl)-1-oxa-3,9-diaza-cyclopentadecane-8,12-dicarboxylic acid 12-hydroxyamide 8-[(2-morpholin-4-yl-2-oxo-ethyl)-amide] 2,10-Dioxo-11-(2'-trifluoromethyl-biphenyl-4-ylmethyl)-1-oxa-3,9-diaza-cyclopentadecane-8,12-dicarboxylic acid 12-hydroxyamide 8-[(2-morpholin-4-yl-2-oxo-ethyl)-amide] | CHEMBL325163
Type:
Small organic molecule
Emp. Form.:
C34H42F3N5O8
Mol. Mass.:
705.7212
SMILES:
ONC(=O)[C@H]1CCCOC(=O)NCCCC[C@H](NC(=O)[C@@H]1Cc1ccc(cc1)-c1ccccc1C(F)(F)F)C(=O)NCC(=O)N1CCOCC1
: