Target
Collagenase 3
Ligand
BDBM50264776
Substrate
Meas. Tech.
ChEMBL_497406 (CHEMBL1002947)
Ki
>5000±n/a nM
Citation
 Georgiadis, DYiotakis, A Specific targeting of metzincin family members with small-molecule inhibitors: progress toward a multifarious challenge. Bioorg Med Chem 16:8781-94 (2008)  
Target
Name:
Collagenase 3
Synonyms:
MMP-13 MMP13_HUMAN Matrix metalloproteinase-13 (MMP-13) | Matrix metalloproteinase-13 (MMP13)
Type:
Enzyme
Mol. Mass.:
53808.06
Organism:
Homo sapiens (Human)
Description:
P45452
Residue:
471
  
Inhibitor
Name:
BDBM50264776
Synonyms:
(2S,3R)-N1-hydroxy-N4-((1S,2R)-2-hydroxy-2,3-dihydro-1H-inden-1-yl)-3-(3-hydroxybenzyl)-2-((1-methylcyclopropyl)methylamino)succinamide | CHEMBL523956
Type:
Small organic molecule
Emp. Form.:
C25H31N3O5
Mol. Mass.:
453.5307
SMILES:
CC1(CN[C@@H]([C@@H](Cc2cccc(O)c2)C(=O)N[C@@H]2[C@H](O)Cc3ccccc23)C(=O)NO)CC1
: