Target
Bone morphogenetic protein 1
Ligand
BDBM50216802
Substrate
Meas. Tech.
ChEMBL_492661 (CHEMBL953090)
Ki
11±n/a nM
Citation
 Georgiadis, DYiotakis, A Specific targeting of metzincin family members with small-molecule inhibitors: progress toward a multifarious challenge. Bioorg Med Chem 16:8781-94 (2008)  
Target
Name:
Bone morphogenetic protein 1
Synonyms:
BMP-1 BMP1_HUMAN PCOLC Procollagen C-proteinase | mTld
Type:
PROTEIN
Mol. Mass.:
111254.03
Organism:
Homo sapiens (Human)
Description:
ChEMBL_518962
Residue:
986
  
Inhibitor
Name:
BDBM50216802
Synonyms:
(3R)-6-cyclohexyl-N-hydroxy-3-(3-{[(methylsulfonyl)amino]-methyl}-1,2,4-oxadiazol-5-yl)hexanamide CHEMBL389020
Type:
Small organic molecule
Emp. Form.:
C16H28N4O5S
Mol. Mass.:
388.482
SMILES:
CS(=O)(=O)NCc1noc(n1)[C@H](CCCC1CCCCC1)CC(=O)NO
: