Target
Bone morphogenetic protein 1
Ligand
BDBM50130121
Substrate
Meas. Tech.
ChEMBL_492661 (CHEMBL953090)
Ki
43±n/a nM
Citation
 Georgiadis, DYiotakis, A Specific targeting of metzincin family members with small-molecule inhibitors: progress toward a multifarious challenge. Bioorg Med Chem 16:8781-94 (2008)  
Target
Name:
Bone morphogenetic protein 1
Synonyms:
BMP-1 BMP1_HUMAN PCOLC Procollagen C-proteinase | mTld
Type:
PROTEIN
Mol. Mass.:
111254.03
Organism:
Homo sapiens (Human)
Description:
ChEMBL_518962
Residue:
986
  
Inhibitor
Name:
BDBM50130121
Synonyms:
(R)-ethyl 4-(4-(N-(benzo[d][1,3]dioxol-5-ylmethyl)-4-methoxy-2,3,6-trimethylphenylsulfonamido)-5-(hydroxyamino)-5-oxopentanoyl)piperazine-1-carboxylate CHEMBL262758
Type:
Small organic molecule
Emp. Form.:
C30H40N4O10S
Mol. Mass.:
648.724
SMILES:
CCOC(=O)N1CCN(CC1)C(=O)CC[C@@H](N(Cc1ccc2OCOc2c1)S(=O)(=O)c1c(C)cc(OC)c(C)c1C)C(=O)NO
: