Target
Disintegrin and metalloproteinase domain-containing protein 9
Ligand
BDBM50203527
Substrate
Meas. Tech.
ChEMBL_492655 (CHEMBL953084)
IC50
>5000±n/a nM
Citation
 Georgiadis, DYiotakis, A Specific targeting of metzincin family members with small-molecule inhibitors: progress toward a multifarious challenge. Bioorg Med Chem 16:8781-94 (2008)  
Target
Name:
Disintegrin and metalloproteinase domain-containing protein 9
Synonyms:
ADAM9 Disintegrin and metalloproteinase domain-containing protein 9 (ADAM9) MCMP MLTNG
Type:
Enzyme
Mol. Mass.:
90567.68
Organism:
Homo sapiens (Human)
Description:
Q13443
Residue:
819
  
Inhibitor
Name:
BDBM50203527
Synonyms:
(6S,7S)-methyl 7-(hydroxycarbamoyl)-6-(4-phenyl-1,2,3,6-tetrahydropyridine-1-carbonyl)-5-azaspiro[2.5]octane-5-carboxylate methyl (6S,7S)-7-[(hydroxyamino)carbonyl]-6-[(4-phenyl-3,6-dihydropyridin-1(2H)-yl)carbonyl]-5-azaspiro[2.5]octane-5-carboxylate
Type:
Small organic molecule
Emp. Form.:
C22H27N3O5
Mol. Mass.:
413.4669
SMILES:
COC(=O)N1CC2(CC2)C[C@@H]([C@H]1C(=O)N1CCC(=CC1)c1ccccc1)C(=O)NO
: