Target
Disintegrin and metalloproteinase domain-containing protein 17
Ligand
BDBM50183715
Substrate
Meas. Tech.
ChEMBL_492682 (CHEMBL953112)
Ki
0.350000±n/a nM
Citation
 Georgiadis, DYiotakis, A Specific targeting of metzincin family members with small-molecule inhibitors: progress toward a multifarious challenge. Bioorg Med Chem 16:8781-94 (2008)  
Target
Name:
Disintegrin and metalloproteinase domain-containing protein 17
Synonyms:
A disintegrin and metalloproteinase domain 17 ADAM 17 Snake venom-like protease TNF-alpha-Converting Enzyme
Type:
Metalloprotease
Mol. Mass.:
12197.99
Organism:
Sus scrofa (pig)
Description:
Partially purified TACE was obtained from porcine spleen.
Residue:
112
  
Inhibitor
Name:
BDBM50183715
Synonyms:
CHEMBL207305 N-(4-(2-(hydroxyamino)-2-oxoethyl)tetrahydro-2H-pyran-4-yl)-4-((2-methylquinolin-4-yl)methoxy)benzamide
Type:
Small organic molecule
Emp. Form.:
C25H27N3O5
Mol. Mass.:
449.499
SMILES:
Cc1cc(COc2ccc(cc2)C(=O)NC2(CC(=O)NO)CCOCC2)c2ccccc2n1
: