Target
Matrilysin
Ligand
BDBM26554
Substrate
Meas. Tech.
ChEMBL_497407 (CHEMBL1002948)
Ki
>2500±n/a nM
Citation
 Georgiadis, DYiotakis, A Specific targeting of metzincin family members with small-molecule inhibitors: progress toward a multifarious challenge. Bioorg Med Chem 16:8781-94 (2008)  
Target
Name:
Matrilysin
Synonyms:
MMP7 MPSL1 Matrix metalloproteinase-7 (MMP-7) PUMP1
Type:
Enzyme
Mol. Mass.:
29681.54
Organism:
Homo sapiens (Human)
Description:
P09237
Residue:
267
  
Inhibitor
Name:
BDBM26554
Synonyms:
3-{[4-(but-2-yn-1-yloxy)benzene]sulfonyl}propane-1-thiol thiol-aryl sulfone, 8b
Type:
Small organic molecule
Emp. Form.:
C13H16O3S2
Mol. Mass.:
284.394
SMILES:
CC#CCOc1ccc(cc1)S(=O)(=O)CCCS
: