Target
Casein kinase I isoform delta
Ligand
BDBM50008516
Substrate
Meas. Tech.
ChEMBL_535967 (CHEMBL987141)
IC50
2570±n/a nM
Citation
 Cozza, GGianoncelli, AMontopoli, MCaparrotta, LVenerando, AMeggio, FPinna, LAZagotto, GMoro, S Identification of novel protein kinase CK1 delta (CK1delta) inhibitors through structure-based virtual screening. Bioorg Med Chem Lett 18:5672-5 (2008)  
Target
Name:
Casein kinase I isoform delta
Synonyms:
CKI-delta CSNK1D Casein kinase I delta Casein kinase I isoform delta (CK1D) KC1D_HUMAN | casein kinases 1 delta (CK1 delta)
Type:
Enzyme
Mol. Mass.:
47356.76
Organism:
Homo sapiens (Human)
Description:
P48730
Residue:
415
  
Inhibitor
Name:
BDBM50008516
Synonyms:
IC261
Type:
Small organic molecule
Emp. Form.:
C18H17NO4
Mol. Mass.:
311.3319
SMILES:
COc1cc(OC)c(C=C2C(O)=Nc3ccccc23)c(OC)c1
: