Target
Casein kinase I isoform gamma-1
Ligand
BDBM50008516
Substrate
Meas. Tech.
ChEMBL_535968 (CHEMBL987142)
IC50
>40000±n/a nM
Citation
 Cozza, GGianoncelli, AMontopoli, MCaparrotta, LVenerando, AMeggio, FPinna, LAZagotto, GMoro, S Identification of novel protein kinase CK1 delta (CK1delta) inhibitors through structure-based virtual screening. Bioorg Med Chem Lett 18:5672-5 (2008)  
Target
Name:
Casein kinase I isoform gamma-1
Synonyms:
CKI-gamma 1 Casein kinase I Casein kinase I isoform gamma-1 | KC1G1_HUMAN
Type:
PROTEIN
Mol. Mass.:
48530.93
Organism:
Homo sapiens (Human)
Description:
ChEMBL_774608
Residue:
422
  
Inhibitor
Name:
BDBM50008516
Synonyms:
IC261
Type:
Small organic molecule
Emp. Form.:
C18H17NO4
Mol. Mass.:
311.3319
SMILES:
COc1cc(OC)c(C=C2C(O)=Nc3ccccc23)c(OC)c1
: