Target
Purine nucleoside phosphorylase
Ligand
BDBM50252865
Substrate
Meas. Tech.
ChEMBL_534711 (CHEMBL982800)
Ki
0.5±n/a nM
Citation
 Mason, JMMurkin, ASLi, LSchramm, VLGainsford, GJSkelton, BW A beta-fluoroamine inhibitor of purine nucleoside phosphorylase. J Med Chem 51:5880-4 (2008)  
Target
Name:
Purine nucleoside phosphorylase
Synonyms:
Inosine phosphorylase NP PNPH_HUMAN | Purine nucleoside phosphorylase (PNPase)
Type:
Enzyme
Mol. Mass.:
32119.53
Organism:
Homo sapiens (Human)
Description:
Residue:
289
  
Inhibitor
Name:
BDBM50252865
Synonyms:
(+/-)-cis-1-((9-Deazahypoxanthin-9-yl)methyl)-4-fluoro-4-hydroxymethylpyrrolidin-3-ol CHEMBL498940 | Immucillins, 1
Type:
Small organic molecule
Emp. Form.:
C12H15FN4O3
Mol. Mass.:
282.2709
SMILES:
OC[C@@]1(F)CN(Cc2c[nH]c3c2nc[nH]c3=O)C[C@@H]1O
: