Target
Sodium- and chloride-dependent glycine transporter 1
Ligand
BDBM50263402
Substrate
Meas. Tech.
ChEMBL_536094 (CHEMBL995040)
EC50
730±n/a nM
Citation
 Jolidon, SAlberati, DDowle, AFischer, HHainzl, DNarquizian, RNorcross, RPinard, E Design, synthesis and structure-activity relationship of simple bis-amides as potent inhibitors of GlyT1. Bioorg Med Chem Lett 18:5533-6 (2008)  
Target
Name:
Sodium- and chloride-dependent glycine transporter 1
Synonyms:
GlyT-1 Glycine Transporters (GlyT1c) SC6A9_HUMAN Sodium- and chloride-dependent glycine transporter 1 Sodium- and chloride-dependent glycine transporter 1 (GlyT1c) Solute carrier family 6 member 9
Type:
Enzyme
Mol. Mass.:
78270.54
Organism:
Homo sapiens (Human)
Description:
P48067
Residue:
706
  
Inhibitor
Name:
BDBM50263402
Synonyms:
4-fluoro-N-(2-oxo-2-(phenyl(pyridin-4-yl)methylamino)ethyl)benzamide | CHEMBL478230
Type:
Small organic molecule
Emp. Form.:
C21H18FN3O2
Mol. Mass.:
363.3849
SMILES:
Fc1ccc(cc1)C(=O)NCC(=O)NC(c1ccccc1)c1ccncc1
: