Target
Cytochrome P450 3A4
Ligand
BDBM50263680
Substrate
Meas. Tech.
ChEMBL_536099 (CHEMBL995045)
IC50
>50000±n/a nM
Citation
 Jolidon, SAlberati, DDowle, AFischer, HHainzl, DNarquizian, RNorcross, RPinard, E Design, synthesis and structure-activity relationship of simple bis-amides as potent inhibitors of GlyT1. Bioorg Med Chem Lett 18:5533-6 (2008)  
Target
Name:
Cytochrome P450 3A4
Synonyms:
Albendazole monooxygenase CP3A4_HUMAN CYP3A4 CYPIIIA4 Cytochrome P450 3A4 (CYP3A4) Nifedipine oxidase Taurochenodeoxycholate 6-alpha-hydroxylase
Type:
Enzyme
Mol. Mass.:
57349.57
Organism:
Homo sapiens (Human)
Description:
Residue:
503
  
Inhibitor
Name:
BDBM50263680
Synonyms:
CHEMBL478035 | N-(2-((2-chloro-9H-thioxanthen-9-yl)methylamino)-2-oxoethyl)-4-fluorobenzamide
Type:
Small organic molecule
Emp. Form.:
C23H18ClFN2O2S
Mol. Mass.:
440.918
SMILES:
Fc1ccc(cc1)C(=O)NCC(=O)NCC1c2ccccc2Sc2ccc(Cl)cc12
: