Target
Cytochrome P450 2D6
Ligand
BDBM50263398
Substrate
Meas. Tech.
ChEMBL_536100 (CHEMBL995046)
IC50
>50000±n/a nM
Citation
 Jolidon, SAlberati, DDowle, AFischer, HHainzl, DNarquizian, RNorcross, RPinard, E Design, synthesis and structure-activity relationship of simple bis-amides as potent inhibitors of GlyT1. Bioorg Med Chem Lett 18:5533-6 (2008)  
Target
Name:
Cytochrome P450 2D6
Synonyms:
CP2D6_HUMAN CYP2DL1 Cytochrome P450 2D6 (CYP2D6) P450-DB1
Type:
Protein
Mol. Mass.:
55774.82
Organism:
Homo sapiens (Human)
Description:
P10635
Residue:
497
  
Inhibitor
Name:
BDBM50263398
Synonyms:
CHEMBL475926 | N-(2-((4-chlorophenyl)(phenyl)methylamino)-2-oxoethyl)-4-fluorobenzamide
Type:
Small organic molecule
Emp. Form.:
C22H18ClFN2O2
Mol. Mass.:
396.842
SMILES:
Fc1ccc(cc1)C(=O)NCC(=O)NC(c1ccccc1)c1ccc(Cl)cc1
: