Target
Muscarinic acetylcholine receptor M4
Ligand
BDBM50263837
Substrate
Meas. Tech.
ChEMBL_536131 (CHEMBL983585)
EC50
>50000±n/a nM
Citation
 Bridges, TMBrady, AEKennedy, JPDaniels, RNMiller, NRKim, KBreininger, MLGentry, PRBrogan, JTJones, CKConn, PJLindsley, CW Synthesis and SAR of analogues of the M1 allosteric agonist TBPB. Part I: Exploration of alternative benzyl and privileged structure moieties. Bioorg Med Chem Lett 18:5439-42 (2008)  
Target
Name:
Muscarinic acetylcholine receptor M4
Synonyms:
ACM4_HUMAN Cholinergic, muscarinic M4 Muscarinic acetylcholine receptor M2 and M4
Type:
Enzyme Catalytic Domain
Mol. Mass.:
53079.31
Organism:
Homo sapiens (Human)
Description:
Cholinergic, muscarinic M4 CHRM4 HUMAN M3::P08173
Residue:
479
  
Inhibitor
Name:
BDBM50263837
Synonyms:
5-Chloro-1-[1'-(2-methyl-benzyl)-[1,4']bipiperidinyl-4-yl]-1,3-dihydro-benzoimidazol-2-one | CHEMBL523657
Type:
Small organic molecule
Emp. Form.:
C25H31ClN4O
Mol. Mass.:
438.993
SMILES:
Cc1ccccc1CN1CCC(CC1)N1CCC(CC1)n1c2ccc(Cl)cc2[nH]c1=O
: