Target
Hormone-sensitive lipase
Ligand
BDBM50147247
Substrate
Meas. Tech.
ChEMBL_538751 (CHEMBL1024870)
IC50
11±n/a nM
Citation
 Taha, MODahabiyeh, LABustanji, YZalloum, HSaleh, S Combining ligand-based pharmacophore modeling, quantitative structure-activity relationship analysis and in silico screening for the discovery of new potent hormone sensitive lipase inhibitors. J Med Chem 51:6478-94 (2008)  
Target
Name:
Hormone-sensitive lipase
Synonyms:
Hormone-sensitive lipase LIPS_RAT | Lipe
Type:
Enzyme
Mol. Mass.:
116814.94
Organism:
Rattus norvegicus (Rat)
Description:
P15304
Residue:
1068
  
Inhibitor
Name:
BDBM50147247
Synonyms:
3-Methyl-2-(piperidine-1-carbonyl)-4-(tetrahydro-thiopyran-4-yl)-2H-isoxazol-5-one CHEMBL323419
Type:
Small organic molecule
Emp. Form.:
C15H22N2O3S
Mol. Mass.:
310.412
SMILES:
Cc1c(C2CCSCC2)c(=O)on1C(=O)N1CCCCC1
: