Target
Hormone-sensitive lipase
Ligand
BDBM50138737
Substrate
Meas. Tech.
ChEMBL_538751 (CHEMBL1024870)
IC50
3±n/a nM
Citation
 Taha, MODahabiyeh, LABustanji, YZalloum, HSaleh, S Combining ligand-based pharmacophore modeling, quantitative structure-activity relationship analysis and in silico screening for the discovery of new potent hormone sensitive lipase inhibitors. J Med Chem 51:6478-94 (2008)  
Target
Name:
Hormone-sensitive lipase
Synonyms:
Hormone-sensitive lipase LIPS_RAT | Lipe
Type:
Enzyme
Mol. Mass.:
116814.94
Organism:
Rattus norvegicus (Rat)
Description:
P15304
Residue:
1068
  
Inhibitor
Name:
BDBM50138737
Synonyms:
3-(4-Chloro-phenyl)-5-(2,2,2-trifluoro-ethylsulfanyl)-[1,2,4]triazole-1-carboxylic acid methyl-phenyl-amide CHEMBL131588
Type:
Small organic molecule
Emp. Form.:
C18H14ClF3N4OS
Mol. Mass.:
426.843
SMILES:
CN(C(=O)n1nc(nc1SCC(F)(F)F)-c1ccc(Cl)cc1)c1ccccc1
: