Target
Hormone-sensitive lipase
Ligand
BDBM50147283
Substrate
Meas. Tech.
ChEMBL_538751 (CHEMBL1024870)
IC50
6±n/a nM
Citation
 Taha, MODahabiyeh, LABustanji, YZalloum, HSaleh, S Combining ligand-based pharmacophore modeling, quantitative structure-activity relationship analysis and in silico screening for the discovery of new potent hormone sensitive lipase inhibitors. J Med Chem 51:6478-94 (2008)  
Target
Name:
Hormone-sensitive lipase
Synonyms:
Hormone-sensitive lipase LIPS_RAT | Lipe
Type:
Enzyme
Mol. Mass.:
116814.94
Organism:
Rattus norvegicus (Rat)
Description:
P15304
Residue:
1068
  
Inhibitor
Name:
BDBM50147283
Synonyms:
4-Isopropyl-3-methyl-2-(4-methyl-piperidine-1-carbonyl)-2H-isoxazol-5-one CHEMBL108519
Type:
Small organic molecule
Emp. Form.:
C14H22N2O3
Mol. Mass.:
266.3361
SMILES:
CC(C)c1c(C)n(oc1=O)C(=O)N1CCC(C)CC1
: