Target
Disks large homolog 4
Ligand
BDBM50253261
Substrate
Meas. Tech.
ChEMBL_539186 (CHEMBL1024690)
Ki
29000±n/a nM
Citation
 Bach, AChi, CNOlsen, TBPedersen, SWRøder, MUPang, GFClausen, RPJemth, PStrømgaard, K Modified peptides as potent inhibitors of the postsynaptic density-95/N-methyl-D-aspartate receptor interaction. J Med Chem 51:6450-9 (2008)  
Target
Name:
Disks large homolog 4
Synonyms:
DLG4 PSD95
Type:
PROTEIN
Mol. Mass.:
80483.80
Organism:
Homo sapiens (Human)
Description:
ChEMBL_736705
Residue:
724
  
Inhibitor
Name:
BDBM50253261
Synonyms:
(S)-4-amino-5-((S)-1-((S)-5-amino-1-((S)-1-carboxy-2-methylpropylamino)-1,5-dioxopentan-2-ylamino)-3-hydroxy-1-oxopropan-2-ylamino)-5-oxopentanoic acid | CHEMBL492284
Type:
Small organic molecule
Emp. Form.:
C18H31N5O9
Mol. Mass.:
461.4668
SMILES:
CC(C)[C@H](NC(=O)[C@H](CCC(N)=O)NC(=O)[C@H](CO)NC(=O)[C@@H](N)CCC(O)=O)C(O)=O
: