Target
Adenosine receptor A2a
Ligand
BDBM50180197
Substrate
Meas. Tech.
ChEMBL_539461 (CHEMBL1028957)
Ki
223±n/a nM
Citation
 Jeong, LSPal, SChoe, SAChoi, WJJacobson, KAGao, ZGKlutz, AMHou, XKim, HOLee, HWLee, SKTosh, DKMoon, HR Structure-activity relationships of truncated D- and l-4'-thioadenosine derivatives as species-independent A3 adenosine receptor antagonists. J Med Chem 51:6609-13 (2008)  
Target
Name:
Adenosine receptor A2a
Synonyms:
A2A adenosine receptor (hA2A) ADENOSINE A2 ADORA2 Adenosine A2A receptor (A2AAR)
Type:
G Protein-Coupled Receptor (GPCR)
Mol. Mass.:
44716.46
Organism:
Homo sapiens (Human)
Description:
P29274
Residue:
412
  
Inhibitor
Name:
BDBM50180197
Synonyms:
(2S,3S,4R,5R)-5-(2-chloro-6-(3-iodobenzylamino)-9H-purin-9-yl)-3,4-dihydroxy-N-methyltetrahydrothiophene-2-carboxamide CHEMBL200732
Type:
Small organic molecule
Emp. Form.:
C18H18ClIN6O3S
Mol. Mass.:
560.796
SMILES:
CNC(=O)[C@H]1S[C@H]([C@H](O)[C@@H]1O)n1cnc2c(NCc3cccc(I)c3)nc(Cl)nc12
: