Target
Mitogen-activated protein kinase 14
Ligand
BDBM50252736
Substrate
Meas. Tech.
ChEMBL_539791 (CHEMBL1035784)
Ki
0.7±n/a nM
Citation
 Pettus, LHXu, SCao, GQChakrabarti, PPRzasa, RMSham, KWurz, RPZhang, DMiddleton, SHenkle, BPlant, MHSaris, CJSherman, LWong, LMPowers, DATudor, YYu, VLee, MRSyed, RHsieh, FTasker, AS 3-amino-7-phthalazinylbenzoisoxazoles as a novel class of potent, selective, and orally available inhibitors of p38alpha mitogen-activated protein kinase. J Med Chem 51:6280-92 (2008)  
Target
Name:
Mitogen-activated protein kinase 14
Synonyms:
CSAID-binding protein CSBP1 CSPB1 MAP kinase 14 MAP kinase p38 alpha MAPK14 MK14_HUMAN Mitogen-activated protein kinase p38 alpha Stress-activated protein kinase 2a | p38 MAP kinase alpha/beta
Type:
Serine/threonine-protein kinase
Mol. Mass.:
41286.76
Organism:
Homo sapiens (Human)
Description:
Q16539
Residue:
360
  
Inhibitor
Name:
BDBM50252736
Synonyms:
CHEMBL522877 | N-Cyclopropyl-6-methyl-7-(1-((S)-3-methylmorpholino)phthalazin-6-yl)benzo[d]isoxazol-3-amine
Type:
Small organic molecule
Emp. Form.:
C24H25N5O2
Mol. Mass.:
415.4876
SMILES:
C[C@H]1COCCN1c1nncc2cc(ccc12)-c1c(C)ccc2c(NC3CC3)noc12
: