Target
Voltage-dependent T-type calcium channel subunit alpha-1I
Ligand
BDBM50252749
Substrate
Meas. Tech.
ChEMBL_538845 (CHEMBL1033088)
IC50
351±n/a nM
Citation
 Yang, ZQBarrow, JCShipe, WDSchlegel, KAShu, YYang, FVLindsley, CWRittle, KEBock, MGHartman, GDUebele, VNNuss, CEFox, SVKraus, RLDoran, SMConnolly, TMTang, CBallard, JEKuo, YAdarayan, EDPrueksaritanont, TZrada, MMMarino, MJGraufelds, VKDiLella, AGReynolds, IJVargas, HMBunting, PBWoltmann, RFMagee, MMKoblan, KSRenger, JJ Discovery of 1,4-substituted piperidines as potent and selective inhibitors of T-type calcium channels. J Med Chem 51:6471-7 (2008)  
Target
Name:
Voltage-dependent T-type calcium channel subunit alpha-1I
Synonyms:
CAC1I_HUMAN KIAA1120 Voltage-gated T-type calcium channel alpha-1I subunit
Type:
PROTEIN
Mol. Mass.:
245101.25
Organism:
Homo sapiens (Human)
Description:
ChEMBL_538845
Residue:
2223
  
Inhibitor
Name:
BDBM50252749
Synonyms:
3-chloro-N-{[1-(3,3-dimethylbutyl)piperidin-4-yl]methyl}benzamide | CHEMBL493680
Type:
Small organic molecule
Emp. Form.:
C19H29ClN2O
Mol. Mass.:
336.899
SMILES:
CC(C)(C)CCN1CCC(CNC(=O)c2cccc(Cl)c2)CC1
: