Target
Potassium voltage-gated channel subfamily H member 2
Ligand
BDBM50252791
Substrate
Meas. Tech.
ChEMBL_538846 (CHEMBL1033089)
IC50
483±n/a nM
Citation
 Yang, ZQBarrow, JCShipe, WDSchlegel, KAShu, YYang, FVLindsley, CWRittle, KEBock, MGHartman, GDUebele, VNNuss, CEFox, SVKraus, RLDoran, SMConnolly, TMTang, CBallard, JEKuo, YAdarayan, EDPrueksaritanont, TZrada, MMMarino, MJGraufelds, VKDiLella, AGReynolds, IJVargas, HMBunting, PBWoltmann, RFMagee, MMKoblan, KSRenger, JJ Discovery of 1,4-substituted piperidines as potent and selective inhibitors of T-type calcium channels. J Med Chem 51:6471-7 (2008)  
Target
Name:
Potassium voltage-gated channel subfamily H member 2
Synonyms:
1,3-beta-glucan synthase component GLS2 ERG Eag-related protein 1 Ether-a-go-go-related gene (HERG) Ether-a-go-go-related gene potassium channel 1 Ether-a-go-go-related gene potassium channel 1 (hERG1) Ether-a-go-go-related protein 1 H-ERG KCNH2 Potassium voltage-gated channel subfamily H member 2 (hERG) Voltage-gated potassium channel subunit Kv11.1 hERG Potassium Channel 1 | putative potassium channel subunit
Type:
Multi-pass membrane protein
Mol. Mass.:
126672.65
Organism:
Homo sapiens (Human)
Description:
Q12809
Residue:
1159
  
Inhibitor
Name:
BDBM50252791
Synonyms:
3,5-dichloro-N-({1-[3-(trifluoromethyl)benzyl]piperidin-4-yl}methyl)benzamide | CHEMBL523525
Type:
Small organic molecule
Emp. Form.:
C21H21Cl2F3N2O
Mol. Mass.:
445.305
SMILES:
FC(F)(F)c1cccc(CN2CCC(CNC(=O)c3cc(Cl)cc(Cl)c3)CC2)c1
: