Target
Group 10 secretory phospholipase A2
Ligand
BDBM50274336
Substrate
Meas. Tech.
ChEMBL_537138 (CHEMBL989798)
IC50
>1600±n/a nM
Citation
 Oslund, RCCermak, NVerlinde, CLGelb, MH Simplified YM-26734 inhibitors of secreted phospholipase A2 group IIA. Bioorg Med Chem Lett 18:5415-9 (2008)  
Target
Name:
Group 10 secretory phospholipase A2
Synonyms:
Group X secretory phospholipase A2 PLA2G10
Type:
PROTEIN
Mol. Mass.:
18153.11
Organism:
Homo sapiens (Human)
Description:
ChEMBL_1442449
Residue:
165
  
Inhibitor
Name:
BDBM50274336
Synonyms:
1-{3-Dodecanoyl-2,4,6-trihydroxy-5-[7-hydroxy-2-(4-hydroxy-phenyl)-chroman-4-yl]-phenyl}-dodecan-1-one YM-26734
Type:
Small organic molecule
Emp. Form.:
C45H62O8
Mol. Mass.:
730.969
SMILES:
CCCCCCCCCCCC(=O)c1c(O)c(C2CC(Oc3cc(O)ccc23)c2ccc(O)cc2)c(O)c(C(=O)CCCCCCCCCCC)c1O
: