Target
Histidine kinase 4
Ligand
BDBM50267036
Substrate
Meas. Tech.
ChEMBL_537150 (CHEMBL989810)
EC50
1100±n/a nM
Citation
 Zatloukal, MGemrotová, MDolezal, KHavlícek, LSpíchal, LStrnad, M Novel potent inhibitors of A. thaliana cytokinin oxidase/dehydrogenase. Bioorg Med Chem 16:9268-75 (2008)  
Target
Name:
Histidine kinase 4
Synonyms:
AHK4 CRE1 RAW1 | WOL
Type:
PROTEIN
Mol. Mass.:
120723.86
Organism:
Arabidopsis thaliana
Description:
ChEMBL_537150
Residue:
1080
  
Inhibitor
Name:
BDBM50267036
Synonyms:
(2E)-2-methyl-4-(9H-purin-6-ylamino)but-2-en-1-ol (E)-2-methyl-4-(1H-purin-6-ylamino)but-2-en-1-ol (E)-zeatin trans-zeatin
Type:
Small organic molecule
Emp. Form.:
C10H13N5O
Mol. Mass.:
219.2431
SMILES:
CC(CO)=CCNc1ncnc2nc[nH]c12
: