Target
Histidine kinase 3
Ligand
BDBM50240929
Substrate
Meas. Tech.
ChEMBL_537151 (CHEMBL989811)
EC50
>50000±n/a nM
Citation
 Zatloukal, MGemrotová, MDolezal, KHavlícek, LSpíchal, LStrnad, M Novel potent inhibitors of A. thaliana cytokinin oxidase/dehydrogenase. Bioorg Med Chem 16:9268-75 (2008)  
Target
Name:
Histidine kinase 3
Synonyms:
AHK3 Histidine kinase | ORE12
Type:
PROTEIN
Mol. Mass.:
116381.97
Organism:
Arabidopsis thaliana
Description:
ChEMBL_537151
Residue:
1036
  
Inhibitor
Name:
BDBM50240929
Synonyms:
6-anilinopurine Phenyl-(9H-purin-6-yl)-amine
Type:
Small organic molecule
Emp. Form.:
C11H9N5
Mol. Mass.:
211.2227
SMILES:
N(c1ccccc1)c1ncnc2nc[nH]c12
: