Target
D(2) dopamine receptor
Ligand
BDBM50274355
Substrate
Meas. Tech.
ChEMBL_536697 (CHEMBL995088)
Ki
43±n/a nM
Citation
 Dörfler, MTschammer, NHamperl, KHübner, HGmeiner, P Novel D3 selective dopaminergics incorporating enyne units as nonaromatic catechol bioisosteres: synthesis, bioactivity, and mutagenesis studies. J Med Chem 51:6829-38 (2008)  
Target
Name:
D(2) dopamine receptor
Synonyms:
D(2) dopamine receptor DOPAMINE D2 Long DRD2 Dopamine D2 receptor Dopamine D2 receptor (D2R) Dopamine2-like | d2
Type:
Cell-surface receptors
Mol. Mass.:
50647.10
Organism:
Homo sapiens (Human)
Description:
P14416
Residue:
443
  
Inhibitor
Name:
BDBM50274355
Synonyms:
CHEMBL484358 | N-[N'-(4-Ethynylcyclohex-3-en-1-yl)-N'-propyl-4-aminobutyl]-4-biphenylcarboxamide
Type:
Small organic molecule
Emp. Form.:
C28H34N2O
Mol. Mass.:
414.5824
SMILES:
CCCN(CCCCNC(=O)c1ccc(cc1)-c1ccccc1)C1CCC(=CC1)C#C
: