Target
D(3) dopamine receptor
Ligand
BDBM50274355
Substrate
Meas. Tech.
ChEMBL_536698 (CHEMBL995089)
Ki
0.21±n/a nM
Citation
 Dörfler, MTschammer, NHamperl, KHübner, HGmeiner, P Novel D3 selective dopaminergics incorporating enyne units as nonaromatic catechol bioisosteres: synthesis, bioactivity, and mutagenesis studies. J Med Chem 51:6829-38 (2008)  
Target
Name:
D(3) dopamine receptor
Synonyms:
DOPAMINE D3 DRD3_HUMAN Dopamine D3 receptor (D3) Dopamine receptor Dopamine receptor D3
Type:
Mol. Mass.:
44243.43
Organism:
Homo sapiens (Human)
Description:
Residue:
400
  
Inhibitor
Name:
BDBM50274355
Synonyms:
CHEMBL484358 | N-[N'-(4-Ethynylcyclohex-3-en-1-yl)-N'-propyl-4-aminobutyl]-4-biphenylcarboxamide
Type:
Small organic molecule
Emp. Form.:
C28H34N2O
Mol. Mass.:
414.5824
SMILES:
CCCN(CCCCNC(=O)c1ccc(cc1)-c1ccccc1)C1CCC(=CC1)C#C
: