Target
Amine oxidase [flavin-containing] A
Ligand
BDBM15613
Substrate
Meas. Tech.
ChEMBL_557971 (CHEMBL965566)
IC50
361000±n/a nM
Citation
 Santana, LGonzález-Díaz, HQuezada, EUriarte, EYáñez, MViña, DOrallo, F Quantitative structure-activity relationship and complex network approach to monoamine oxidase A and B inhibitors. J Med Chem 51:6740-51 (2008)  
Target
Name:
Amine oxidase [flavin-containing] A
Synonyms:
AOFA_HUMAN MAO-A Monoamine oxidase Monoamine oxidase type A (MAO A) Monoamine oxidase type A (MAOA)
Type:
Protein
Mol. Mass.:
59689.53
Organism:
Homo sapiens (Human)
Description:
P21397
Residue:
527
  
Inhibitor
Name:
BDBM15613
Synonyms:
4-chloro-N-(2-morpholin-4-ylethyl)benzamide Aurorix MCL | Moclobemide
Type:
Small organic molecule
Emp. Form.:
C13H17ClN2O2
Mol. Mass.:
268.739
SMILES:
Clc1ccc(cc1)C(=O)NCCN1CCOCC1
: