Target
Receptor-type tyrosine-protein kinase FLT3
Ligand
BDBM50276057
Substrate
Meas. Tech.
ChEMBL_492794 (CHEMBL939483)
IC50
134±n/a nM
Citation
 Ishida, HIsami, SMatsumura, TUmehara, HYamashita, YKajita, JFuse, EKiyoi, HNaoe, TAkinaga, SShiotsu, YArai, H Novel and orally active 5-(1,3,4-oxadiazol-2-yl)pyrimidine derivatives as selective FLT3 inhibitors. Bioorg Med Chem Lett 18:5472-7 (2008)  
Target
Name:
Receptor-type tyrosine-protein kinase FLT3
Synonyms:
CD135 FL cytokine receptor FLK2 FLT3 Fetal liver kinase-2 Fms-like tyrosine kinase 3 (Flt-3) STK-1 Stem cell tyrosine kinase 1
Type:
Enzyme
Mol. Mass.:
112888.62
Organism:
Homo sapiens (Human)
Description:
P36888
Residue:
993
  
Inhibitor
Name:
BDBM50276057
Synonyms:
5-(5-cyclopropyl-1,3,4-oxadiazol-2-yl)-N2-(2-(pyridin-4-yl)ethyl)-N4-o-tolylpyrimidine-2,4-diamine | CHEMBL470387
Type:
Small organic molecule
Emp. Form.:
C23H23N7O
Mol. Mass.:
413.475
SMILES:
Cc1ccccc1Nc1nc(NCCc2ccncc2)ncc1-c1nnc(o1)C1CC1
: