Target
B-cell receptor CD22
Ligand
BDBM50274302
Substrate
Meas. Tech.
ChEMBL_537287 (CHEMBL985383)
IC50
6220±n/a nM
Citation
 Abdu-Allah, HHTamanaka, TYu, JZhuoyuan, LSadagopan, MAdachi, TTsubata, TKelm, SIshida, HKiso, M Design, synthesis, and structure-affinity relationships of novel series of sialosides as CD22-specific inhibitors. J Med Chem 51:6665-81 (2008)  
Target
Name:
B-cell receptor CD22
Synonyms:
CD22 SIGLEC2
Type:
PROTEIN
Mol. Mass.:
95348.60
Organism:
Homo sapiens (Human)
Description:
ChEMBL_727026
Residue:
847
  
Inhibitor
Name:
BDBM50274302
Synonyms:
CHEMBL448298 | p-Methoxyphenyl (9-4(4-biphenyl)butylamino-3,5,9-trideoxy-5-glycolamido-D-glycero-alpha-D-galacto-2-nonulopyranosylonic acid)-(2->6)-beta-D-galactopyranoside
Type:
Small organic molecule
Emp. Form.:
C40H52N2O15
Mol. Mass.:
800.8453
SMILES:
COc1ccc(O[C@@H]2O[C@H](CO[C@@]3(C[C@H](O)[C@@H](NC(=O)CO)[C@@H](O3)[C@H](O)[C@H](O)CNCCCCc3ccc(cc3)-c3ccccc3)C(O)=O)[C@H](O)[C@H](O)[C@H]2O)cc1
: