Target
B-cell receptor CD22
Ligand
BDBM50274298
Substrate
Meas. Tech.
ChEMBL_537287 (CHEMBL985383)
IC50
24760±n/a nM
Citation
 Abdu-Allah, HHTamanaka, TYu, JZhuoyuan, LSadagopan, MAdachi, TTsubata, TKelm, SIshida, HKiso, M Design, synthesis, and structure-affinity relationships of novel series of sialosides as CD22-specific inhibitors. J Med Chem 51:6665-81 (2008)  
Target
Name:
B-cell receptor CD22
Synonyms:
CD22 SIGLEC2
Type:
PROTEIN
Mol. Mass.:
95348.60
Organism:
Homo sapiens (Human)
Description:
ChEMBL_727026
Residue:
847
  
Inhibitor
Name:
BDBM50274298
Synonyms:
CHEMBL450770 | p-Methoxyphenyl (3,5,9-trideoxy-5-glycolamido-9-(3,5-dimethoxybenzyl)amino-D-glycero-alpha-D-galacto-2-nonulopyranosylonic acid)-(2->6)-beta-D-galactopyranoside
Type:
Small organic molecule
Emp. Form.:
C33H46N2O17
Mol. Mass.:
742.7215
SMILES:
COc1ccc(O[C@@H]2O[C@H](CO[C@@]3(C[C@H](O)[C@@H](NC(=O)CO)[C@@H](O3)[C@H](O)[C@H](O)CNCc3cc(OC)cc(OC)c3)C(O)=O)[C@H](O)[C@H](O)[C@H]2O)cc1
: