Target
P2Y purinoceptor 1
Ligand
BDBM50245984
Substrate
Meas. Tech.
ChEMBL_558003 (CHEMBL965598)
IC50
3200±n/a nM
Citation
 Morales-Ramos, AIMecom, JSKiesow, TJGraybill, TLBrown, GDAiyar, NVDavenport, EAKallal, LAKnapp-Reed, BALi, PLondregan, ATMorrow, DMSenadhi, SThalji, RKZhao, SBurns-Kurtis, CLMarino, JP Tetrahydro-4-quinolinamines identified as novel P2Y(1) receptor antagonists. Bioorg Med Chem Lett 18:6222-6 (2008)  
Target
Name:
P2Y purinoceptor 1
Synonyms:
ATP receptor P2RY1_HUMAN P2Y1 Purinergic receptor P2Y1
Type:
Enzyme
Mol. Mass.:
42090.25
Organism:
Homo sapiens (Human)
Description:
P47900
Residue:
373
  
Inhibitor
Name:
BDBM50245984
Synonyms:
CHEMBL516508 | cis-(2(R)-ethyl-4-(phenylamino)-3,4-dihydroquinolin-1(2H)-yl)(4-methoxyphenyl)methanone
Type:
Small organic molecule
Emp. Form.:
C25H26N2O2
Mol. Mass.:
386.4861
SMILES:
CC[C@@H]1C[C@H](Nc2ccccc2)c2ccccc2N1C(=O)c1ccc(OC)cc1
: