Target
P2Y purinoceptor 1
Ligand
BDBM50245934
Substrate
Meas. Tech.
ChEMBL_558004 (CHEMBL965599)
Ki
300±n/a nM
Citation
 Morales-Ramos, AIMecom, JSKiesow, TJGraybill, TLBrown, GDAiyar, NVDavenport, EAKallal, LAKnapp-Reed, BALi, PLondregan, ATMorrow, DMSenadhi, SThalji, RKZhao, SBurns-Kurtis, CLMarino, JP Tetrahydro-4-quinolinamines identified as novel P2Y(1) receptor antagonists. Bioorg Med Chem Lett 18:6222-6 (2008)  
Target
Name:
P2Y purinoceptor 1
Synonyms:
ATP receptor P2RY1_HUMAN P2Y1 Purinergic receptor P2Y1
Type:
Enzyme
Mol. Mass.:
42090.25
Organism:
Homo sapiens (Human)
Description:
P47900
Residue:
373
  
Inhibitor
Name:
BDBM50245934
Synonyms:
(2R,3S,4S)-N-(4-chlorophenyl)-2-ethyl-3-methyl-4-(phenylamino)-3,4-dihydroquinoline-1(2H)-carboxamide | CHEMBL462367
Type:
Small organic molecule
Emp. Form.:
C25H26ClN3O
Mol. Mass.:
419.946
SMILES:
CC[C@@H]1[C@@H](C)[C@H](Nc2ccccc2)c2ccccc2N1C(=O)Nc1ccc(Cl)cc1
: