Target
Focal adhesion kinase 1
Ligand
BDBM50246140
Substrate
Meas. Tech.
ChEMBL_558213 (CHEMBL962347)
IC50
1.9±n/a nM
Citation
 Walker, DPBi, FCKalgutkar, ASBauman, JNZhao, SXSoglia, JRAspnes, GEKung, DWKlug-McLeod, JZawistoski, MPMcGlynn, MAOliver, RDunn, MLi, JCRichter, DTCooper, BAKath, JCHulford, CAAutry, CLLuzzio, MJUng, EJRoberts, WGBonnette, PCBuckbinder, LMistry, AGriffor, MCHan, SGuzman-Perez, A Trifluoromethylpyrimidine-based inhibitors of proline-rich tyrosine kinase 2 (PYK2): structure-activity relationships and strategies for the elimination of reactive metabolite formation. Bioorg Med Chem Lett 18:6071-7 (2008)  
Target
Name:
Focal adhesion kinase 1
Synonyms:
FADK 1 FAK1 FLT4 Focal adhesion kinase (FAK) Focal adhesion kinase 1 (FAK) Focal adhesion kinase-related nonkinase PTK2 Protein-tyrosine kinase 2 p125FAK | pp125FAK
Type:
Tyrosine-protein kinase
Mol. Mass.:
119233.17
Organism:
Homo sapiens (Human)
Description:
Q05397
Residue:
1052
  
Inhibitor
Name:
BDBM50246140
Synonyms:
CHEMBL513744 N-methyl-N-(3-((2-(2-oxoindolin-5-ylamino)-5-(trifluoromethyl)pyrimidin-4-ylamino)methyl)phenyl)methanesulfonamide
Type:
Small organic molecule
Emp. Form.:
C22H21F3N6O3S
Mol. Mass.:
506.501
SMILES:
CN(c1cccc(CNc2nc(Nc3ccc4NC(=O)Cc4c3)ncc2C(F)(F)F)c1)S(C)(=O)=O
: