Target
Focal adhesion kinase 1
Ligand
BDBM50246188
Substrate
Meas. Tech.
ChEMBL_558213 (CHEMBL962347)
IC50
59±n/a nM
Citation
 Walker, DPBi, FCKalgutkar, ASBauman, JNZhao, SXSoglia, JRAspnes, GEKung, DWKlug-McLeod, JZawistoski, MPMcGlynn, MAOliver, RDunn, MLi, JCRichter, DTCooper, BAKath, JCHulford, CAAutry, CLLuzzio, MJUng, EJRoberts, WGBonnette, PCBuckbinder, LMistry, AGriffor, MCHan, SGuzman-Perez, A Trifluoromethylpyrimidine-based inhibitors of proline-rich tyrosine kinase 2 (PYK2): structure-activity relationships and strategies for the elimination of reactive metabolite formation. Bioorg Med Chem Lett 18:6071-7 (2008)  
Target
Name:
Focal adhesion kinase 1
Synonyms:
FADK 1 FAK1 FLT4 Focal adhesion kinase (FAK) Focal adhesion kinase 1 (FAK) Focal adhesion kinase-related nonkinase PTK2 Protein-tyrosine kinase 2 p125FAK | pp125FAK
Type:
Tyrosine-protein kinase
Mol. Mass.:
119233.17
Organism:
Homo sapiens (Human)
Description:
Q05397
Residue:
1052
  
Inhibitor
Name:
BDBM50246188
Synonyms:
5-(4-(2-(methylsulfonyl)benzylamino)-5-(trifluoromethyl)pyrimidin-2-ylamino)indolin-2-one | CHEMBL488089
Type:
Small organic molecule
Emp. Form.:
C21H18F3N5O3S
Mol. Mass.:
477.46
SMILES:
CS(=O)(=O)c1ccccc1CNc1nc(Nc2ccc3NC(=O)Cc3c2)ncc1C(F)(F)F
: