Target
Protein-tyrosine kinase 2-beta
Ligand
BDBM50246189
Substrate
Meas. Tech.
ChEMBL_558214 (CHEMBL960612)
IC50
17±n/a nM
Citation
 Walker, DPBi, FCKalgutkar, ASBauman, JNZhao, SXSoglia, JRAspnes, GEKung, DWKlug-McLeod, JZawistoski, MPMcGlynn, MAOliver, RDunn, MLi, JCRichter, DTCooper, BAKath, JCHulford, CAAutry, CLLuzzio, MJUng, EJRoberts, WGBonnette, PCBuckbinder, LMistry, AGriffor, MCHan, SGuzman-Perez, A Trifluoromethylpyrimidine-based inhibitors of proline-rich tyrosine kinase 2 (PYK2): structure-activity relationships and strategies for the elimination of reactive metabolite formation. Bioorg Med Chem Lett 18:6071-7 (2008)  
Target
Name:
Protein-tyrosine kinase 2-beta
Synonyms:
FAK2 PTK2B PTK2B protein tyrosine kinase 2 beta (PTK2B) Protein tyrosine kinase 2 beta | RAFTK
Type:
Protein
Mol. Mass.:
115868.80
Organism:
Homo sapiens (Human)
Description:
Q14289
Residue:
1009
  
Inhibitor
Name:
BDBM50246189
Synonyms:
5-(4-(2-(pyrrolidin-1-ylsulfonyl)benzylamino)-5-(trifluoromethyl)pyrimidin-2-ylamino)indolin-2-one | CHEMBL529889
Type:
Small organic molecule
Emp. Form.:
C24H23F3N6O3S
Mol. Mass.:
532.538
SMILES:
FC(F)(F)c1cnc(Nc2ccc3NC(=O)Cc3c2)nc1NCc1ccccc1S(=O)(=O)N1CCCC1
: