Target
Focal adhesion kinase 1
Ligand
BDBM50246096
Substrate
Meas. Tech.
ChEMBL_558213 (CHEMBL962347)
IC50
16±n/a nM
Citation
 Walker, DPBi, FCKalgutkar, ASBauman, JNZhao, SXSoglia, JRAspnes, GEKung, DWKlug-McLeod, JZawistoski, MPMcGlynn, MAOliver, RDunn, MLi, JCRichter, DTCooper, BAKath, JCHulford, CAAutry, CLLuzzio, MJUng, EJRoberts, WGBonnette, PCBuckbinder, LMistry, AGriffor, MCHan, SGuzman-Perez, A Trifluoromethylpyrimidine-based inhibitors of proline-rich tyrosine kinase 2 (PYK2): structure-activity relationships and strategies for the elimination of reactive metabolite formation. Bioorg Med Chem Lett 18:6071-7 (2008)  
Target
Name:
Focal adhesion kinase 1
Synonyms:
FADK 1 FAK1 FLT4 Focal adhesion kinase (FAK) Focal adhesion kinase 1 (FAK) Focal adhesion kinase-related nonkinase PTK2 Protein-tyrosine kinase 2 p125FAK | pp125FAK
Type:
Tyrosine-protein kinase
Mol. Mass.:
119233.17
Organism:
Homo sapiens (Human)
Description:
Q05397
Residue:
1052
  
Inhibitor
Name:
BDBM50246096
Synonyms:
CHEMBL471526 | N2-(1H-indazol-5-yl)-N4-(pyridin-2-ylmethyl)-5-(trifluoromethyl)pyrimidine-2,4-diamine
Type:
Small organic molecule
Emp. Form.:
C18H14F3N7
Mol. Mass.:
385.3459
SMILES:
FC(F)(F)c1cnc(Nc2ccc3[nH]ncc3c2)nc1NCc1ccccn1
: