Target
Protein-tyrosine kinase 2-beta
Ligand
BDBM50246284
Substrate
Meas. Tech.
ChEMBL_558214 (CHEMBL960612)
IC50
25±n/a nM
Citation
 Walker, DPBi, FCKalgutkar, ASBauman, JNZhao, SXSoglia, JRAspnes, GEKung, DWKlug-McLeod, JZawistoski, MPMcGlynn, MAOliver, RDunn, MLi, JCRichter, DTCooper, BAKath, JCHulford, CAAutry, CLLuzzio, MJUng, EJRoberts, WGBonnette, PCBuckbinder, LMistry, AGriffor, MCHan, SGuzman-Perez, A Trifluoromethylpyrimidine-based inhibitors of proline-rich tyrosine kinase 2 (PYK2): structure-activity relationships and strategies for the elimination of reactive metabolite formation. Bioorg Med Chem Lett 18:6071-7 (2008)  
Target
Name:
Protein-tyrosine kinase 2-beta
Synonyms:
FAK2 PTK2B PTK2B protein tyrosine kinase 2 beta (PTK2B) Protein tyrosine kinase 2 beta | RAFTK
Type:
Protein
Mol. Mass.:
115868.80
Organism:
Homo sapiens (Human)
Description:
Q14289
Residue:
1009
  
Inhibitor
Name:
BDBM50246284
Synonyms:
CHEMBL487057 | N4-((1R,2R)-2-Dimethylamino-cyclopentyl)-N2-(2-methyl-1,1-dioxo-2,3-dihydro-1H-1lambda6-benzo[d]isothiazol-5-yl)-5-trifluoromethyl-pyrimidine-2,4-diamine
Type:
Small organic molecule
Emp. Form.:
C20H25F3N6O2S
Mol. Mass.:
470.512
SMILES:
CN(C)[C@@H]1CCC[C@H]1Nc1nc(Nc2ccc3c(CN(C)S3(=O)=O)c2)ncc1C(F)(F)F
: