Target
Protein-tyrosine kinase 2-beta
Ligand
BDBM50246330
Substrate
Meas. Tech.
ChEMBL_558214 (CHEMBL960612)
IC50
6±n/a nM
Citation
 Walker, DPBi, FCKalgutkar, ASBauman, JNZhao, SXSoglia, JRAspnes, GEKung, DWKlug-McLeod, JZawistoski, MPMcGlynn, MAOliver, RDunn, MLi, JCRichter, DTCooper, BAKath, JCHulford, CAAutry, CLLuzzio, MJUng, EJRoberts, WGBonnette, PCBuckbinder, LMistry, AGriffor, MCHan, SGuzman-Perez, A Trifluoromethylpyrimidine-based inhibitors of proline-rich tyrosine kinase 2 (PYK2): structure-activity relationships and strategies for the elimination of reactive metabolite formation. Bioorg Med Chem Lett 18:6071-7 (2008)  
Target
Name:
Protein-tyrosine kinase 2-beta
Synonyms:
FAK2 PTK2B PTK2B protein tyrosine kinase 2 beta (PTK2B) Protein tyrosine kinase 2 beta | RAFTK
Type:
Protein
Mol. Mass.:
115868.80
Organism:
Homo sapiens (Human)
Description:
Q14289
Residue:
1009
  
Inhibitor
Name:
BDBM50246330
Synonyms:
1-{6-[4-((1R,2R)-2-Dimethylamino-cyclopentylamino)-5-trifluoromethyl-pyrimidin-2-ylamino]-1,2,3,4-tetrahydro-1,4-epiazano-naphthalen-9-yl}-ethanone | CHEMBL455680
Type:
Small organic molecule
Emp. Form.:
C24H29F3N6O
Mol. Mass.:
474.5219
SMILES:
CN(C)[C@@H]1CCC[C@H]1Nc1nc(Nc2ccc3C4CCC(N4C(C)=O)c3c2)ncc1C(F)(F)F
: