Target
Amine oxidase [flavin-containing] B
Ligand
BDBM50273591
Substrate
Meas. Tech.
ChEMBL_536002 (CHEMBL988018)
Ki
11000±n/a nM
Citation
 La Regina, GSilvestri, RGatti, VLavecchia, ANovellino, EBefani, OTurini, PAgostinelli, E Synthesis, structure-activity relationships and molecular modeling studies of new indole inhibitors of monoamine oxidases A and B. Bioorg Med Chem 16:9729-40 (2008)  
Target
Name:
Amine oxidase [flavin-containing] B
Synonyms:
AOFB_BOVIN MAO-B Monoamine Oxidase Type B (MAO-B) Monoamine oxidase B | Monoamine oxidase type B
Type:
PROTEIN
Mol. Mass.:
58428.94
Organism:
Bos taurus
Description:
ChEMBL_1501478
Residue:
520
  
Inhibitor
Name:
BDBM50273591
Synonyms:
CHEMBL459962 | N-(1-Methyl-1H-indol-2-ylmethyl)-N-methyl-N-phenylamine
Type:
Small organic molecule
Emp. Form.:
C17H18N2
Mol. Mass.:
250.3382
SMILES:
CN(Cc1cc2ccccc2n1C)c1ccccc1
: